[MBDyn-users] installation problem

Jinmo Lee jinmol at andrew.cmu.edu
Wed Aug 12 21:06:07 CEST 2009


I'd like to install MBDyn.
I typed configure and make consequently,
but the terminal returns error messages.


I am including error message as below;

icc -DHAVE_CONFIG_H -I. -I../../include -I../../include -I./../../include
-I./../../libraries/libmbutil -I./../../libraries/libmbmath
-I./../../mbdyn    -g -O2 -MT testexcept.o -MD -MP -MF
.deps/testexcept.Tpo -c -o testexcept.o testexcept.cc
mv -f .deps/testexcept.Tpo .deps/testexcept.Po
/bin/sh ../../libtool --tag=CXX   --mode=link icc  -g -O2   -o testexcept
testexcept.o libmbutil.la
icc -g -O2 -o testexcept testexcept.o  ./.libs/libmbutil.a
testexcept.o: In function `main':
/disk1/mbdyn-1.3.9/libraries/libmbutil/testexcept.cc:64: undefined
reference to `std::cout'
/disk1/mbdyn-1.3.9/libraries/libmbutil/testexcept.cc:64: undefined
reference to `std::basic_ostream<char, std::char_traits<char> >&
std::operator<< <std::char_traits<char> >(std::basic_ostream<char,
std::char_traits<char> >&, char const*)'
/disk1/mbdyn-1.3.9/libraries/libmbutil/testexcept.cc:65: undefined
reference to `std::basic_ostream<char, std::char_traits<char> >&
std::endl<char, std::char_traits<char> >(std::basic_ostream<char,
std::char_traits<char> >&)'
/disk1/mbdyn-1.3.9/libraries/libmbutil/testexcept.cc:65: undefined
reference to `std::ostream::operator<<(std::ostream& (*)(std::ostream&))'
/disk1/mbdyn-1.3.9/libraries/libmbutil/testexcept.cc:65: undefined
reference to `std::basic_ostream<char, std::char_traits<char> >&
std::endl<char, std::char_traits<char> >(std::basic_ostream<char,
std::char_traits<char> >&)'
/disk1/mbdyn-1.3.9/libraries/libmbutil/testexcept.cc:65: undefined
reference to `std::ostream::operator<<(std::ostream& (*)(std::ostream&))'
/disk1/mbdyn-1.3.9/libraries/libmbutil/testexcept.cc:68: undefined
reference to `__cxa_allocate_exception'
/disk1/mbdyn-1.3.9/libraries/libmbutil/testexcept.cc:68: undefined
reference to `std::basic_string<char, std::char_traits<char>,
std::allocator<char> >::basic_string()'
/disk1/mbdyn-1.3.9/libraries/libmbutil/testexcept.cc:68: undefined
reference to `std::basic_string<char, std::char_traits<char>,
std::allocator<char> >::basic_string(std::string const&)'
/disk1/mbdyn-1.3.9/libraries/libmbutil/testexcept.cc:68: undefined
reference to `std::basic_string<char, std::char_traits<char>,
std::allocator<char> >::~basic_string()'
/disk1/mbdyn-1.3.9/libraries/libmbutil/testexcept.cc:68: undefined
reference to `__cxa_throw'
/disk1/mbdyn-1.3.9/libraries/libmbutil/testexcept.cc:72: undefined
reference to `__cxa_allocate_exception'
/disk1/mbdyn-1.3.9/libraries/libmbutil/testexcept.cc:72: undefined
reference to `std::allocator<char>::allocator()'
/disk1/mbdyn-1.3.9/libraries/libmbutil/testexcept.cc:72: undefined
reference to `std::basic_string<char, std::char_traits<char>,
std::allocator<char> >::basic_string(char const*, std::allocator<char>
const&)'
/disk1/mbdyn-1.3.9/libraries/libmbutil/testexcept.cc:72: undefined
reference to `std::basic_string<char, std::char_traits<char>,
std::allocator<char> >::basic_string(std::string const&)'
/disk1/mbdyn-1.3.9/libraries/libmbutil/testexcept.cc:72: undefined
reference to `std::basic_string<char, std::char_traits<char>,
std::allocator<char> >::~basic_string()'
/disk1/mbdyn-1.3.9/libraries/libmbutil/testexcept.cc:72: undefined
reference to `__cxa_throw'
/disk1/mbdyn-1.3.9/libraries/libmbutil/testexcept.cc:76: undefined
reference to `__cxa_allocate_exception'
/disk1/mbdyn-1.3.9/libraries/libmbutil/testexcept.cc:76: undefined
reference to `std::allocator<char>::allocator()'
/disk1/mbdyn-1.3.9/libraries/libmbutil/testexcept.cc:76: undefined
reference to `std::basic_string<char, std::char_traits<char>,
std::allocator<char> >::basic_string(char const*, std::allocator<char>
const&)'
/disk1/mbdyn-1.3.9/libraries/libmbutil/testexcept.cc:76: undefined
reference to `std::basic_string<char, std::char_traits<char>,
std::allocator<char> >::basic_string(std::string const&)'
/disk1/mbdyn-1.3.9/libraries/libmbutil/testexcept.cc:76: undefined
reference to `std::basic_string<char, std::char_traits<char>,
std::allocator<char> >::~basic_string()'
/disk1/mbdyn-1.3.9/libraries/libmbutil/testexcept.cc:76: undefined
reference to `std::basic_string<char, std::char_traits<char>,
std::allocator<char> >::basic_string()'
/disk1/mbdyn-1.3.9/libraries/libmbutil/testexcept.cc:76: undefined
reference to `std::basic_stringstream<char, std::char_traits<char>,
std::allocator<char> >::basic_stringstream(std::_Ios_Openmode)'
/disk1/mbdyn-1.3.9/libraries/libmbutil/testexcept.cc:76: undefined
reference to `std::basic_ostream<char, std::char_traits<char> >&
std::operator<< <std::char_traits<char> >(std::basic_ostream<char,
std::char_traits<char> >&, char const*)'
/disk1/mbdyn-1.3.9/libraries/libmbutil/testexcept.cc:76: undefined
reference to `std::basic_ostream<char, std::char_traits<char> >&
std::operator<< <std::char_traits<char> >(std::basic_ostream<char,
std::char_traits<char> >&, char const*)'
/disk1/mbdyn-1.3.9/libraries/libmbutil/testexcept.cc:76: undefined
reference to `std::ostream::operator<<(int)'
/disk1/mbdyn-1.3.9/libraries/libmbutil/testexcept.cc:76: undefined
reference to `std::basic_stringstream<char, std::char_traits<char>,
std::allocator<char> >::str() const'
/disk1/mbdyn-1.3.9/libraries/libmbutil/testexcept.cc:76: undefined
reference to `std::string::operator=(std::string const&)'
/disk1/mbdyn-1.3.9/libraries/libmbutil/testexcept.cc:76: undefined
reference to `std::basic_string<char, std::char_traits<char>,
std::allocator<char> >::~basic_string()'
/disk1/mbdyn-1.3.9/libraries/libmbutil/testexcept.cc:76: undefined
reference to `std::basic_stringstream<char, std::char_traits<char>,
std::allocator<char> >::~basic_stringstream()'
/disk1/mbdyn-1.3.9/libraries/libmbutil/testexcept.cc:76: undefined
reference to `__cxa_throw'
/disk1/mbdyn-1.3.9/libraries/libmbutil/testexcept.cc:76: undefined
reference to `std::basic_string<char, std::char_traits<char>,
std::allocator<char> >::~basic_string()'
/disk1/mbdyn-1.3.9/libraries/libmbutil/testexcept.cc:76: undefined
reference to `std::allocator<char>::~allocator()'
/disk1/mbdyn-1.3.9/libraries/libmbutil/testexcept.cc:68: undefined
reference to `std::basic_string<char, std::char_traits<char>,
std::allocator<char> >::~basic_string()'
/disk1/mbdyn-1.3.9/libraries/libmbutil/testexcept.cc:68: undefined
reference to `std::basic_string<char, std::char_traits<char>,
std::allocator<char> >::~basic_string()'
/disk1/mbdyn-1.3.9/libraries/libmbutil/testexcept.cc:72: undefined
reference to `std::allocator<char>::~allocator()'
/disk1/mbdyn-1.3.9/libraries/libmbutil/testexcept.cc:72: undefined
reference to `std::basic_string<char, std::char_traits<char>,
std::allocator<char> >::~basic_string()'
/disk1/mbdyn-1.3.9/libraries/libmbutil/testexcept.cc:72: undefined
reference to `std::basic_string<char, std::char_traits<char>,
std::allocator<char> >::~basic_string()'
/disk1/mbdyn-1.3.9/libraries/libmbutil/testexcept.cc:76: undefined
reference to `std::basic_string<char, std::char_traits<char>,
std::allocator<char> >::~basic_string()'
/disk1/mbdyn-1.3.9/libraries/libmbutil/testexcept.cc:76: undefined
reference to `std::basic_string<char, std::char_traits<char>,
std::allocator<char> >::~basic_string()'
/disk1/mbdyn-1.3.9/libraries/libmbutil/testexcept.cc:76: undefined
reference to `std::basic_stringstream<char, std::char_traits<char>,
std::allocator<char> >::~basic_stringstream()'
/disk1/mbdyn-1.3.9/libraries/libmbutil/testexcept.cc:76: undefined
reference to `std::basic_string<char, std::char_traits<char>,
std::allocator<char> >::~basic_string()'
testexcept.o: In function `__sti__$E':
/usr/include/c++/4.1.2/iostream:65536: undefined reference to
`std::ios_base::Init::Init()'
/usr/include/c++/4.1.2/iostream:65536: undefined reference to
`std::ios_base::Init::~Init()'
testexcept.o: In function `MBDynErrBase::~MBDynErrBase()':
/usr/include/c++/4.1.2/iostream:65536: undefined reference to
`std::basic_string<char, std::char_traits<char>, std::allocator<char>
>::~basic_string()'
testexcept.o: In function `MBDynErrBase::~MBDynErrBase()':
testexcept.cc:(.gnu.linkonce.t._ZN12MBDynErrBaseD2Ev[.gnu.linkonce.t._ZN12MBDynErrBaseD2Ev]+0x3e):
undefined reference to `std::exception::~exception()'
testexcept.cc:(.gnu.linkonce.t._ZN12MBDynErrBaseD2Ev[.gnu.linkonce.t._ZN12MBDynErrBaseD2Ev]+0x6f):
undefined reference to `std::exception::~exception()'
testexcept.cc:(.gnu.linkonce.t._ZN12MBDynErrBaseD2Ev[.gnu.linkonce.t._ZN12MBDynErrBaseD2Ev]+0x7a):
undefined reference to `__cxa_call_unexpected'
testexcept.o: In function `ErrPlain::~ErrPlain()':
testexcept.cc:(.gnu.linkonce.t._ZN8ErrPlainD1Ev[.gnu.linkonce.t._ZN8ErrPlainD1Ev]+0x36):
undefined reference to `std::basic_string<char, std::char_traits<char>,
std::allocator<char> >::~basic_string()'
testexcept.cc:(.gnu.linkonce.t._ZN8ErrPlainD1Ev[.gnu.linkonce.t._ZN8ErrPlainD1Ev]+0x3e):
undefined reference to `std::exception::~exception()'
testexcept.cc:(.gnu.linkonce.t._ZN8ErrPlainD1Ev[.gnu.linkonce.t._ZN8ErrPlainD1Ev]+0x6f):
undefined reference to `std::exception::~exception()'
testexcept.cc:(.gnu.linkonce.t._ZN8ErrPlainD1Ev[.gnu.linkonce.t._ZN8ErrPlainD1Ev]+0x7a):
undefined reference to `__cxa_call_unexpected'
testexcept.o: In function `ErrPlain::~ErrPlain()':
testexcept.cc:(.gnu.linkonce.t._ZN8ErrPlainD0Ev[.gnu.linkonce.t._ZN8ErrPlainD0Ev]+0x36):
undefined reference to `std::basic_string<char, std::char_traits<char>,
std::allocator<char> >::~basic_string()'
testexcept.cc:(.gnu.linkonce.t._ZN8ErrPlainD0Ev[.gnu.linkonce.t._ZN8ErrPlainD0Ev]+0x3e):
undefined reference to `std::exception::~exception()'
testexcept.cc:(.gnu.linkonce.t._ZN8ErrPlainD0Ev[.gnu.linkonce.t._ZN8ErrPlainD0Ev]+0x46):
undefined reference to `operator delete(void*)'
testexcept.cc:(.gnu.linkonce.t._ZN8ErrPlainD0Ev[.gnu.linkonce.t._ZN8ErrPlainD0Ev]+0x77):
undefined reference to `std::exception::~exception()'
testexcept.cc:(.gnu.linkonce.t._ZN8ErrPlainD0Ev[.gnu.linkonce.t._ZN8ErrPlainD0Ev]+0x82):
undefined reference to `__cxa_call_unexpected'
testexcept.o: In function `ErrCode::~ErrCode()':
testexcept.cc:(.gnu.linkonce.t._ZN7ErrCodeD1Ev[.gnu.linkonce.t._ZN7ErrCodeD1Ev]+0x33):
undefined reference to `std::basic_string<char, std::char_traits<char>,
std::allocator<char> >::~basic_string()'
testexcept.cc:(.gnu.linkonce.t._ZN7ErrCodeD1Ev[.gnu.linkonce.t._ZN7ErrCodeD1Ev]+0x4d):
undefined reference to `std::basic_string<char, std::char_traits<char>,
std::allocator<char> >::~basic_string()'
testexcept.cc:(.gnu.linkonce.t._ZN7ErrCodeD1Ev[.gnu.linkonce.t._ZN7ErrCodeD1Ev]+0x57):
undefined reference to `std::exception::~exception()'
testexcept.cc:(.gnu.linkonce.t._ZN7ErrCodeD1Ev[.gnu.linkonce.t._ZN7ErrCodeD1Ev]+0x93):
undefined reference to `__cxa_call_unexpected'
testexcept.cc:(.gnu.linkonce.t._ZN7ErrCodeD1Ev[.gnu.linkonce.t._ZN7ErrCodeD1Ev]+0xac):
undefined reference to `std::exception::~exception()'
testexcept.cc:(.gnu.linkonce.t._ZN7ErrCodeD1Ev[.gnu.linkonce.t._ZN7ErrCodeD1Ev]+0xb7):
undefined reference to `__cxa_call_unexpected'
testexcept.o: In function `ErrCode::~ErrCode()':
testexcept.cc:(.gnu.linkonce.t._ZN7ErrCodeD0Ev[.gnu.linkonce.t._ZN7ErrCodeD0Ev]+0x36):
undefined reference to `std::basic_string<char, std::char_traits<char>,
std::allocator<char> >::~basic_string()'
testexcept.cc:(.gnu.linkonce.t._ZN7ErrCodeD0Ev[.gnu.linkonce.t._ZN7ErrCodeD0Ev]+0x4b):
undefined reference to `std::basic_string<char, std::char_traits<char>,
std::allocator<char> >::~basic_string()'
testexcept.cc:(.gnu.linkonce.t._ZN7ErrCodeD0Ev[.gnu.linkonce.t._ZN7ErrCodeD0Ev]+0x53):
undefined reference to `std::exception::~exception()'
testexcept.cc:(.gnu.linkonce.t._ZN7ErrCodeD0Ev[.gnu.linkonce.t._ZN7ErrCodeD0Ev]+0x5b):
undefined reference to `operator delete(void*)'
testexcept.cc:(.gnu.linkonce.t._ZN7ErrCodeD0Ev[.gnu.linkonce.t._ZN7ErrCodeD0Ev]+0x97):
undefined reference to `__cxa_call_unexpected'
testexcept.cc:(.gnu.linkonce.t._ZN7ErrCodeD0Ev[.gnu.linkonce.t._ZN7ErrCodeD0Ev]+0xb0):
undefined reference to `std::exception::~exception()'
testexcept.cc:(.gnu.linkonce.t._ZN7ErrCodeD0Ev[.gnu.linkonce.t._ZN7ErrCodeD0Ev]+0xbb):
undefined reference to `__cxa_call_unexpected'
testexcept.o: In function `ErrCode::what() const':
testexcept.cc:(.gnu.linkonce.t._ZNK7ErrCode4whatEv[.gnu.linkonce.t._ZNK7ErrCode4whatEv]+0x27):
undefined reference to `std::string::c_str() const'
testexcept.cc:(.gnu.linkonce.t._ZNK7ErrCode4whatEv[.gnu.linkonce.t._ZNK7ErrCode4whatEv]+0x59):
undefined reference to `__cxa_call_unexpected'
testexcept.o:(.gnu.linkonce.d._ZTI7ErrCode[.gnu.linkonce.d._ZTI7ErrCode]+0x0):
undefined reference to `vtable for __cxxabiv1::__si_class_type_info'
testexcept.o:(.gnu.linkonce.d._ZTI8ErrPlain[.gnu.linkonce.d._ZTI8ErrPlain]+0x0):
undefined reference to `vtable for __cxxabiv1::__si_class_type_info'
testexcept.o:(.eh_frame+0x12): undefined reference to `__gxx_personality_v0'
./.libs/libmbutil.a(except.o): In function `__sti__$E':
/usr/include/c++/4.1.2/iostream:65536: undefined reference to
`std::ios_base::Init::Init()'
/usr/include/c++/4.1.2/iostream:65536: undefined reference to
`std::ios_base::Init::~Init()'
./.libs/libmbutil.a(except.o): In function
`MBDynErrBase::MBDynErrBase(char const*, int, char const*, std::string)':
/disk1/mbdyn-1.3.9/libraries/libmbutil/except.cc:39: undefined reference
to `std::basic_string<char, std::char_traits<char>, std::allocator<char>
>::basic_string()'
/disk1/mbdyn-1.3.9/libraries/libmbutil/except.cc:41: undefined reference
to `std::basic_stringstream<char, std::char_traits<char>,
std::allocator<char> >::basic_stringstream(std::_Ios_Openmode)'
/disk1/mbdyn-1.3.9/libraries/libmbutil/except.cc:42: undefined reference
to `std::basic_ostream<char, std::char_traits<char> >& std::operator<<
<std::char_traits<char> >(std::basic_ostream<char, std::char_traits<char>
>&, char const*)'
/disk1/mbdyn-1.3.9/libraries/libmbutil/except.cc:42: undefined reference
to `std::basic_ostream<char, std::char_traits<char> >& std::operator<<
<std::char_traits<char> >(std::basic_ostream<char, std::char_traits<char>
>&, char const*)'
/disk1/mbdyn-1.3.9/libraries/libmbutil/except.cc:42: undefined reference
to `std::basic_ostream<char, std::char_traits<char> >& std::operator<<
<std::char_traits<char> >(std::basic_ostream<char, std::char_traits<char>
>&, char const*)'
/disk1/mbdyn-1.3.9/libraries/libmbutil/except.cc:42: undefined reference
to `std::ostream::operator<<(int)'
/disk1/mbdyn-1.3.9/libraries/libmbutil/except.cc:42: undefined reference
to `std::basic_ostream<char, std::char_traits<char> >& std::operator<<
<std::char_traits<char> >(std::basic_ostream<char, std::char_traits<char>
>&, char const*)'
/disk1/mbdyn-1.3.9/libraries/libmbutil/except.cc:42: undefined reference
to `std::basic_ostream<char, std::char_traits<char> >& std::operator<<
<std::char_traits<char> >(std::basic_ostream<char, std::char_traits<char>
>&, char const*)'
/disk1/mbdyn-1.3.9/libraries/libmbutil/except.cc:42: undefined reference
to `std::basic_ostream<char, std::char_traits<char> >& std::operator<<
<std::char_traits<char> >(std::basic_ostream<char, std::char_traits<char>
>&, char const*)'
/disk1/mbdyn-1.3.9/libraries/libmbutil/except.cc:43: undefined reference
to `std::string::empty() const'
/disk1/mbdyn-1.3.9/libraries/libmbutil/except.cc:44: undefined reference
to `std::basic_ostream<char, std::char_traits<char> >& std::operator<<
<std::char_traits<char> >(std::basic_ostream<char, std::char_traits<char>
>&, char const*)'
/disk1/mbdyn-1.3.9/libraries/libmbutil/except.cc:44: undefined reference
to `std::basic_ostream<char, std::char_traits<char> >& std::operator<<
<char, std::char_traits<char>, std::allocator<char>
>(std::basic_ostream<char, std::char_traits<char> >&,
std::basic_string<char, std::char_traits<char>, std::allocator<char> >
const&)'
/disk1/mbdyn-1.3.9/libraries/libmbutil/except.cc:44: undefined reference
to `std::basic_ostream<char, std::char_traits<char> >& std::operator<<
<std::char_traits<char> >(std::basic_ostream<char, std::char_traits<char>
>&, char const*)'
/disk1/mbdyn-1.3.9/libraries/libmbutil/except.cc:46: undefined reference
to `std::basic_stringstream<char, std::char_traits<char>,
std::allocator<char> >::str() const'
/disk1/mbdyn-1.3.9/libraries/libmbutil/except.cc:46: undefined reference
to `std::string::operator=(std::string const&)'
/disk1/mbdyn-1.3.9/libraries/libmbutil/except.cc:46: undefined reference
to `std::basic_string<char, std::char_traits<char>, std::allocator<char>
>::~basic_string()'
/disk1/mbdyn-1.3.9/libraries/libmbutil/except.cc:46: undefined reference
to `std::basic_stringstream<char, std::char_traits<char>,
std::allocator<char> >::~basic_stringstream()'
/disk1/mbdyn-1.3.9/libraries/libmbutil/except.cc:39: undefined reference
to `std::exception::~exception()'
/disk1/mbdyn-1.3.9/libraries/libmbutil/except.cc:39: undefined reference
to `std::basic_string<char, std::char_traits<char>, std::allocator<char>
>::~basic_string()'
/disk1/mbdyn-1.3.9/libraries/libmbutil/except.cc:41: undefined reference
to `std::basic_stringstream<char, std::char_traits<char>,
std::allocator<char> >::~basic_stringstream()'
/disk1/mbdyn-1.3.9/libraries/libmbutil/except.cc:46: undefined reference
to `std::basic_string<char, std::char_traits<char>, std::allocator<char>
>::~basic_string()'
./.libs/libmbutil.a(except.o): In function `MBDynErrBase::what() const':
/disk1/mbdyn-1.3.9/libraries/libmbutil/except.cc:52: undefined reference
to `std::string::c_str() const'
/disk1/mbdyn-1.3.9/libraries/libmbutil/except.cc:51: undefined reference
to `__cxa_call_unexpected'
./.libs/libmbutil.a(except.o): In function `MBDynErrBase::~MBDynErrBase()':
/disk1/mbdyn-1.3.9/libraries/libmbutil/except.cc:51: undefined reference
to `std::basic_string<char, std::char_traits<char>, std::allocator<char>
>::~basic_string()'
./.libs/libmbutil.a(except.o): In function `MBDynErrBase::~MBDynErrBase()':
except.cc:(.gnu.linkonce.t._ZN12MBDynErrBaseD1Ev[.gnu.linkonce.t._ZN12MBDynErrBaseD1Ev]+0x44):
undefined reference to `std::exception::~exception()'
except.cc:(.gnu.linkonce.t._ZN12MBDynErrBaseD1Ev[.gnu.linkonce.t._ZN12MBDynErrBaseD1Ev]+0x75):
undefined reference to `std::exception::~exception()'
except.cc:(.gnu.linkonce.t._ZN12MBDynErrBaseD1Ev[.gnu.linkonce.t._ZN12MBDynErrBaseD1Ev]+0x80):
undefined reference to `__cxa_call_unexpected'
./.libs/libmbutil.a(except.o): In function `MBDynErrBase::~MBDynErrBase()':
except.cc:(.gnu.linkonce.t._ZN12MBDynErrBaseD0Ev[.gnu.linkonce.t._ZN12MBDynErrBaseD0Ev]+0x3d):
undefined reference to `std::basic_string<char, std::char_traits<char>,
std::allocator<char> >::~basic_string()'
except.cc:(.gnu.linkonce.t._ZN12MBDynErrBaseD0Ev[.gnu.linkonce.t._ZN12MBDynErrBaseD0Ev]+0x45):
undefined reference to `std::exception::~exception()'
except.cc:(.gnu.linkonce.t._ZN12MBDynErrBaseD0Ev[.gnu.linkonce.t._ZN12MBDynErrBaseD0Ev]+0x4d):
undefined reference to `operator delete(void*)'
except.cc:(.gnu.linkonce.t._ZN12MBDynErrBaseD0Ev[.gnu.linkonce.t._ZN12MBDynErrBaseD0Ev]+0x7e):
undefined reference to `std::exception::~exception()'
except.cc:(.gnu.linkonce.t._ZN12MBDynErrBaseD0Ev[.gnu.linkonce.t._ZN12MBDynErrBaseD0Ev]+0x89):
undefined reference to `__cxa_call_unexpected'
./.libs/libmbutil.a(except.o):(.gnu.linkonce.d._ZTI12MBDynErrBase[.gnu.linkonce.d._ZTI12MBDynErrBase]+0x0):
undefined reference to `vtable for __cxxabiv1::__si_class_type_info'
./.libs/libmbutil.a(except.o):(.gnu.linkonce.d._ZTI12MBDynErrBase[.gnu.linkonce.d._ZTI12MBDynErrBase]+0x10):
undefined reference to `typeinfo for std::exception'
./.libs/libmbutil.a(except.o):(.gnu.linkonce.d.DW.ref.__gxx_personality_v0+0x0):
undefined reference to `__gxx_personality_v0'
make[2]: *** [testexcept] Error 1
make[2]: Leaving directory `/disk1/mbdyn-1.3.9/libraries/libmbutil'
make[1]: *** [all-recursive] Error 1
make[1]: Leaving directory `/disk1/mbdyn-1.3.9/libraries'
make: *** [all-recursive] Error 1




More information about the MBDyn-users mailing list